Target
Nicotinamide phosphoribosyltransferase
Ligand
BDBM50569517
Substrate
Meas. Tech.
ChEMBL_2109463 (CHEMBL4818138)
EC50
2280±n/a nM
Citation
 Pinkerton, ABSessions, EHHershberger, PMaloney, PRPeddibhotla, SHopf, MSergienko, EMa, CTSmith, LHJackson, MRTanaka, JTsuji, TAkiu, MCohen, SENakamura, TGardell, SJ Optimization of a urea-containing series of nicotinamide phosphoribosyltransferase (NAMPT) activators. Bioorg Med Chem Lett 41:0 (2021)  
Target
Name:
Nicotinamide phosphoribosyltransferase
Synonyms:
NAMPT NAmPRTase Nicotinamide phosphoribosyltransferase (NAMPT) PBEF1 | Pre-B-cell colony-enhancing factor 1
Type:
Enzyme
Mol. Mass.:
55524.98
Organism:
Homo sapiens (Human)
Description:
P43490
Residue:
491
  
Inhibitor
Name:
BDBM50569517
Synonyms:
CHEMBL4879262
Type:
Small organic molecule
Emp. Form.:
C17H19N3O3
Mol. Mass.:
313.3511
SMILES:
CCOC(=O)c1ccc(NC(=O)NC(C)c2ccncc2)cc1
: