Target
Nicotinamide phosphoribosyltransferase
Ligand
BDBM50569523
Substrate
Meas. Tech.
ChEMBL_2109463 (CHEMBL4818138)
EC50
279±n/a nM
Citation
 Pinkerton, ABSessions, EHHershberger, PMaloney, PRPeddibhotla, SHopf, MSergienko, EMa, CTSmith, LHJackson, MRTanaka, JTsuji, TAkiu, MCohen, SENakamura, TGardell, SJ Optimization of a urea-containing series of nicotinamide phosphoribosyltransferase (NAMPT) activators. Bioorg Med Chem Lett 41:0 (2021)  
Target
Name:
Nicotinamide phosphoribosyltransferase
Synonyms:
NAMPT NAmPRTase Nicotinamide phosphoribosyltransferase (NAMPT) PBEF1 | Pre-B-cell colony-enhancing factor 1
Type:
Enzyme
Mol. Mass.:
55524.98
Organism:
Homo sapiens (Human)
Description:
P43490
Residue:
491
  
Inhibitor
Name:
BDBM50569523
Synonyms:
CHEMBL4846686 | US11452717, Compound TableB-2.190
Type:
Small organic molecule
Emp. Form.:
C19H22N4O4S
Mol. Mass.:
402.467
SMILES:
O=C(NCc1ccncc1)Nc1ccc(cc1)S(=O)(=O)N1CC2CCC(C1)O2
: