Target
Nicotinamide phosphoribosyltransferase
Ligand
BDBM50569526
Substrate
Meas. Tech.
ChEMBL_2109463 (CHEMBL4818138)
EC50
3110±n/a nM
Citation
 Pinkerton, ABSessions, EHHershberger, PMaloney, PRPeddibhotla, SHopf, MSergienko, EMa, CTSmith, LHJackson, MRTanaka, JTsuji, TAkiu, MCohen, SENakamura, TGardell, SJ Optimization of a urea-containing series of nicotinamide phosphoribosyltransferase (NAMPT) activators. Bioorg Med Chem Lett 41:0 (2021)  
Target
Name:
Nicotinamide phosphoribosyltransferase
Synonyms:
NAMPT NAmPRTase Nicotinamide phosphoribosyltransferase (NAMPT) PBEF1 | Pre-B-cell colony-enhancing factor 1
Type:
Enzyme
Mol. Mass.:
55524.98
Organism:
Homo sapiens (Human)
Description:
P43490
Residue:
491
  
Inhibitor
Name:
BDBM50569526
Synonyms:
CHEMBL4876062 | US11452717, Compound TableB-2.162
Type:
Small organic molecule
Emp. Form.:
C15H18N4O3S
Mol. Mass.:
334.393
SMILES:
CN(C)S(=O)(=O)c1ccc(NC(=O)NCc2ccncc2)cc1
: