Target
Nicotinamide phosphoribosyltransferase
Ligand
BDBM50569534
Substrate
Meas. Tech.
ChEMBL_2109463 (CHEMBL4818138)
EC50
85±n/a nM
Citation
 Pinkerton, ABSessions, EHHershberger, PMaloney, PRPeddibhotla, SHopf, MSergienko, EMa, CTSmith, LHJackson, MRTanaka, JTsuji, TAkiu, MCohen, SENakamura, TGardell, SJ Optimization of a urea-containing series of nicotinamide phosphoribosyltransferase (NAMPT) activators. Bioorg Med Chem Lett 41:0 (2021)  
Target
Name:
Nicotinamide phosphoribosyltransferase
Synonyms:
NAMPT NAmPRTase Nicotinamide phosphoribosyltransferase (NAMPT) PBEF1 | Pre-B-cell colony-enhancing factor 1
Type:
Enzyme
Mol. Mass.:
55524.98
Organism:
Homo sapiens (Human)
Description:
P43490
Residue:
491
  
Inhibitor
Name:
BDBM50569534
Synonyms:
CHEMBL4868692 | US11452717, Compound TableB-2.224
Type:
Small organic molecule
Emp. Form.:
C19H17N3O3S
Mol. Mass.:
367.422
SMILES:
O=C(NCc1ccncc1)Nc1ccc(cc1)S(=O)(=O)c1ccccc1
: