Target
Nicotinamide phosphoribosyltransferase
Ligand
BDBM50569538
Substrate
Meas. Tech.
ChEMBL_2109463 (CHEMBL4818138)
EC50
28±n/a nM
Citation
 Pinkerton, ABSessions, EHHershberger, PMaloney, PRPeddibhotla, SHopf, MSergienko, EMa, CTSmith, LHJackson, MRTanaka, JTsuji, TAkiu, MCohen, SENakamura, TGardell, SJ Optimization of a urea-containing series of nicotinamide phosphoribosyltransferase (NAMPT) activators. Bioorg Med Chem Lett 41:0 (2021)  
Target
Name:
Nicotinamide phosphoribosyltransferase
Synonyms:
NAMPT NAmPRTase Nicotinamide phosphoribosyltransferase (NAMPT) PBEF1 | Pre-B-cell colony-enhancing factor 1
Type:
Enzyme
Mol. Mass.:
55524.98
Organism:
Homo sapiens (Human)
Description:
P43490
Residue:
491
  
Inhibitor
Name:
BDBM50569538
Synonyms:
CHEMBL4859010 | US11452717, Compound TableB-1.48
Type:
Small organic molecule
Emp. Form.:
C17H16N4O3S
Mol. Mass.:
356.399
SMILES:
O=C(NCc1cn[nH]c1)Nc1ccc(cc1)S(=O)(=O)c1ccccc1
: