Target
Nicotinamide phosphoribosyltransferase
Ligand
BDBM50569541
Substrate
Meas. Tech.
ChEMBL_2109463 (CHEMBL4818138)
EC50
70±n/a nM
Citation
 Pinkerton, ABSessions, EHHershberger, PMaloney, PRPeddibhotla, SHopf, MSergienko, EMa, CTSmith, LHJackson, MRTanaka, JTsuji, TAkiu, MCohen, SENakamura, TGardell, SJ Optimization of a urea-containing series of nicotinamide phosphoribosyltransferase (NAMPT) activators. Bioorg Med Chem Lett 41:0 (2021)  
Target
Name:
Nicotinamide phosphoribosyltransferase
Synonyms:
NAMPT NAmPRTase Nicotinamide phosphoribosyltransferase (NAMPT) PBEF1 | Pre-B-cell colony-enhancing factor 1
Type:
Enzyme
Mol. Mass.:
55524.98
Organism:
Homo sapiens (Human)
Description:
P43490
Residue:
491
  
Inhibitor
Name:
BDBM50569541
Synonyms:
CHEMBL4859855 | US11452717, Compound TableB-5.29
Type:
Small organic molecule
Emp. Form.:
C18H14F3N3O5S
Mol. Mass.:
441.381
SMILES:
FC(F)(F)Oc1cccc(c1)S(=O)(=O)c1ccc(NC(=O)NCc2cnco2)cc1
: