Target
Leucine--tRNA ligase
Ligand
BDBM50569958
Substrate
Meas. Tech.
ChEMBL_2110785 (CHEMBL4819635)
Ki
32±n/a nM
Citation
 De Ruysscher, DPang, LLenders, SMGCappoen, DCos, PRozenski, JStrelkov, SVWeeks, SDVan Aerschot, A Synthesis and structure-activity studies of novel anhydrohexitol-based Leucyl-tRNA synthetase inhibitors. Eur J Med Chem 211:0 (2021)  
Target
Name:
Leucine--tRNA ligase
Synonyms:
6.1.1.4 Leucine--tRNA ligase SYL_ECOLI | leuS
Type:
PROTEIN
Mol. Mass.:
97211.51
Organism:
Escherichia coli (strain K12)
Description:
ChEMBL_117811
Residue:
860
  
Inhibitor
Name:
BDBM50569958
Synonyms:
CHEMBL4864716
Type:
Small organic molecule
Emp. Form.:
C22H34N6O7S
Mol. Mass.:
526.606
SMILES:
CC(C)C[C@H](N)C(=O)NS(=O)(=O)OC[C@H]1OC[C@@H](CCCn2cc(nn2)-c2cccnc2)[C@H](O)[C@@H]1O
: