Target
Retinoic acid receptor RXR-alpha
Ligand
BDBM50135459
Substrate
Meas. Tech.
ChEMBL_196626 (CHEMBL798016)
Ki
4.4±n/a nM
Citation
 Michellys, PYBoehm, MFChen, JHGrese, TAKaranewsky, DSLeibowitz, MDLiu, SMais, DAMapes, CMReifel-Miller, AOgilvie, KMRungta, DThompson, AWTyhonas, JSYumibe, NArdecky, RJ Design and synthesis of novel RXR-selective modulators with improved pharmacological profile. Bioorg Med Chem Lett 13:4071-5 (2003)  
Target
Name:
Retinoic acid receptor RXR-alpha
Synonyms:
NR2B1 Nuclear receptor subfamily 4 group A member 2 RXRA Retinoic acid receptor RXR-alpha/gamma Retinoid receptor
Type:
PROTEIN
Mol. Mass.:
50820.38
Organism:
Homo sapiens (Human)
Description:
ChEMBL_1456363
Residue:
462
  
Inhibitor
Name:
BDBM50135459
Synonyms:
(2E,4E,6E)-7-(2-Butoxy-3,5-diisopropyl-phenyl)-6-fluoro-3-methyl-octa-2,4,6-trienoic acid | CHEMBL131826
Type:
Small organic molecule
Emp. Form.:
C25H35FO3
Mol. Mass.:
402.542
SMILES:
CCCCOc1c(cc(cc1\C(C)=C(\F)/C=C/C(/C)=C/C(O)=O)C(C)C)C(C)C
: