Target
Endoplasmic reticulum aminopeptidase 2
Ligand
BDBM50076744
Substrate
Meas. Tech.
ChEMBL_2113197 (CHEMBL4822047)
IC50
11±n/a nM
Citation
 Wilding, BPasqua, AEE A Chessum, NPierrat, OAHahner, TTomlin, KShehu, EBurke, RRichards, GMWhitton, BArwert, ENThapaliya, ASalimraj, Rvan Montfort, RSkawinska, AHayes, ARaynaud, FChopra, RJones, KNewton, GCheeseman, MD Investigating the phosphinic acid tripeptide mimetic DG013A as a tool compound inhibitor of the M1-aminopeptidase ERAP1. Bioorg Med Chem Lett 42:0 (2021)  
Target
Name:
Endoplasmic reticulum aminopeptidase 2
Synonyms:
Aminopeptidase ERAP2_HUMAN | LRAP
Type:
PROTEIN
Mol. Mass.:
110463.90
Organism:
Homo sapiens (Human)
Description:
ChEMBL_1473169
Residue:
960
  
Inhibitor
Name:
BDBM50076744
Synonyms:
CHEMBL3416733
Type:
Small organic molecule
Emp. Form.:
C27H37N4O4P
Mol. Mass.:
512.5808
SMILES:
CC(C)C[C@H](CP(O)(=O)[C@@H](N)CCc1ccccc1)C(=O)N[C@@H](Cc1c[nH]c2ccccc12)C(N)=O
: