Target
Eukaryotic translation initiation factor 2 subunit 1
Ligand
BDBM50570949
Substrate
Meas. Tech.
ChEMBL_2113376 (CHEMBL4822226)
IC50
3020±n/a nM
Citation
 Calvo, VSurguladze, DLi, AHSurman, MDMalibhatla, SBandaru, MJonnalagadda, SKAdarasandi, RVelmala, MSingireddi, DRPVelpuri, MNareddy, BRSastry, VMandati, CGuguloth, RSiddiqui, SPatil, BSChad, EWolfley, JGasparek, JFeldman, KBetzenhauser, MWiens, BKoszelak-Rosenblum, MZhu, GDu, HRigby, ACMulvihill, MJ Discovery of 2-amino-3-amido-5-aryl-pyridines as highly potent, orally bioavailable, and efficacious PERK kinase inhibitors. Bioorg Med Chem Lett 43:0 (2021)  
Target
Name:
Eukaryotic translation initiation factor 2 subunit 1
Synonyms:
EIF2A Eukaryotic translation initiation factor 2 subunit alpha eIF-2-alpha eIF-2alpha
Type:
PROTEIN
Mol. Mass.:
36100.17
Organism:
Homo sapiens
Description:
ChEMBL_103542
Residue:
315
  
Inhibitor
Name:
BDBM50570949
Synonyms:
CHEMBL4848921
Type:
Small organic molecule
Emp. Form.:
C25H28N4O3
Mol. Mass.:
432.5148
SMILES:
CC(C)NC(=O)c1cc(cnc1N)-c1ccc(NC(=O)[C@@](C)(O)c2ccccc2)cc1C
: