Target
Prostacyclin receptor
Ligand
BDBM50136234
Substrate
Meas. Tech.
ChEBML_158014
Ki
54±n/a nM
Citation
 Hattori, KTabuchi, SOkitsu, OTaniguchi, K A simple stereoselective synthesis and biological evaluation of FR181157: orally active prostacyclin mimetic. Bioorg Med Chem Lett 13:4277-9 (2003)  
Target
Name:
Prostacyclin receptor
Synonyms:
PGI receptor PRIPR Prostacyclin (IP) Receptor Prostaglandin I Prostaglandin I2 receptor | Prostanoid IP receptor
Type:
G Protein-Coupled Receptor (GPCR)
Mol. Mass.:
40968.22
Organism:
Homo sapiens (Human)
Description:
The membranes prepared from human platelet were used in binding assay.
Residue:
386
  
Inhibitor
Name:
BDBM50136234
Synonyms:
CHEMBL132589 Sodium; {3-[(R)-2-(4,5-diphenyl-oxazol-2-yl)-cyclohex-2-enylmethyl]-phenoxy}-acetate Sodium; {3-[2-(4,5-diphenyl-oxazol-2-yl)-cyclohex-2-enylmethyl]-phenoxy}-acetate | sodium (S)-2-(3-((2-(4,5-diphenyloxazol-2-yl)cyclohex-2-enyl)methyl)phenoxy)acetate
Type:
Small organic molecule
Emp. Form.:
C30H26NO4
Mol. Mass.:
464.5323
SMILES:
[O-]C(=O)COc1cccc(CC2CCCC=C2c2nc(c(o2)-c2ccccc2)-c2ccccc2)c1
: