Target
60 kDa heat shock protein, mitochondrial
Ligand
BDBM50450011
Substrate
Meas. Tech.
ChEMBL_2114004 (CHEMBL4822854)
IC50
6700±n/a nM
Citation
 Ray, AMSalim, NStevens, MChitre, SAbdeen, SWashburn, ASivinski, JO'Hagan, HMChapman, EJohnson, SM Exploiting the HSP60/10 chaperonin system as a chemotherapeutic target for colorectal cancer. Bioorg Med Chem 40:0 (2021)  
Target
Name:
60 kDa heat shock protein, mitochondrial
Synonyms:
3.6.4.9 60 kDa heat shock protein, mitochondrial CPN60 HSP-60 HSP60/HSP10 Heat shock protein 60 Mitochondrial matrix protein P1 | P60 lymphocyte protein
Type:
PROTEIN
Mol. Mass.:
61050.41
Organism:
Homo sapiens
Description:
ChEMBL_117701
Residue:
573
  
Inhibitor
Name:
BDBM50450011
Synonyms:
CHEMBL4161487
Type:
Small organic molecule
Emp. Form.:
C24H14Cl2F3N3O5S3
Mol. Mass.:
648.481
SMILES:
FC(F)(F)c1cc(ccc1Cl)S(=O)(=O)Nc1ccc(cc1)-c1nc2cc(NS(=O)(=O)c3ccc(Cl)s3)ccc2o1
: