Target
5-hydroxytryptamine receptor 2A
Ligand
BDBM50130262
Substrate
Meas. Tech.
ChEMBL_2640 (CHEMBL618695)
Ki
3000±n/a nM
Citation
 Grella, BTeitler, MSmith, CHerrick-Davis, KGlennon, RA Binding of beta-carbolines at 5-HT(2) serotonin receptors. Bioorg Med Chem Lett 13:4421-5 (2003)  
Target
Name:
5-hydroxytryptamine receptor 2A
Synonyms:
5-HT-2A 5-HT2A 5-hydroxytryptamine receptor 2A (5HT2A) Htr2 Serotonin Receptor 2A
Type:
G Protein-Coupled Receptor (GPCR)
Mol. Mass.:
52852.05
Organism:
Rattus norvegicus (rat)
Description:
Rat cortex membranes 5-HT2A receptors.
Residue:
471
  
Inhibitor
Name:
BDBM50130262
Synonyms:
2,3,4,9-Tetrahydro-1H-beta-carboline EN300-119677
Type:
Small organic molecule
Emp. Form.:
C11H12N2
Mol. Mass.:
172.2264
SMILES:
C1Cc2c(CN1)[nH]c1ccccc21
: