Target
Lon protease homolog, mitochondrial
Ligand
BDBM50571492
Substrate
Meas. Tech.
ChEMBL_2114930 (CHEMBL4823871)
IC50
59±n/a nM
Citation
 Kingsley, LJHe, XMcNeill, MNelson, JNikulin, VMa, ZLu, WZhou, VWManuia, MKreusch, AGao, MYWitmer, DVaillancourt, MTLu, MGreenblatt, SLee, CVashisht, ABender, SSpraggon, GMichellys, PYJia, YHaling, JRLelais, G Structure-Based Design of Selective LONP1 Inhibitors for Probing  J Med Chem 64:4857-4869 (2021)  
Target
Name:
Lon protease homolog, mitochondrial
Synonyms:
3.4.21.53 LONM_HUMAN LONP1 Lon protease-like protein PRSS15 | Serine protease 15
Type:
PROTEIN
Mol. Mass.:
106485.52
Organism:
Homo sapiens
Description:
ChEMBL_120400
Residue:
959
  
Inhibitor
Name:
BDBM50571492
Synonyms:
CHEMBL4870013
Type:
Small organic molecule
Emp. Form.:
C21H30BN3O5
Mol. Mass.:
415.291
SMILES:
CCC[C@@H](NC(=O)c1oc(C)nc1C)C(=O)N[C@@H](CCCc1ccccc1)B(O)O
: