Target
Transient receptor potential cation channel subfamily M member 5
Ligand
BDBM50571572
Substrate
Meas. Tech.
ChEMBL_2115166 (CHEMBL4824107)
EC50
44±n/a nM
Citation
 Barilli, AAldegheri, LBianchi, FBrault, LBrodbeck, DCastelletti, LFeriani, ALingard, IMyers, RNola, SPiccoli, LPompilio, DRaveglia, LFSalvagno, CTassini, SVirginio, CSabat, M From High-Throughput Screening to Target Validation: Benzo[ J Med Chem 64:5931-5955 (2021)  
Target
Name:
Transient receptor potential cation channel subfamily M member 5
Synonyms:
LTrpC-5 Ltrpc5 Mtr1 Synonyms=Ltrpc5 Transient receptor potential cation channel subfamily M member 5 | Trpm5
Type:
PROTEIN
Mol. Mass.:
130839.35
Organism:
Mus musculus
Description:
ChEMBL_117216
Residue:
1158
  
Inhibitor
Name:
BDBM50571572
Synonyms:
CHEMBL4854482
Type:
Small organic molecule
Emp. Form.:
C11H8ClN3S2
Mol. Mass.:
281.784
SMILES:
Clc1cnc(CNc2ccc3cnsc3c2)s1
: