Target
Aminopeptidase N
Ligand
BDBM50076744
Substrate
Meas. Tech.
ChEMBL_2115925 (CHEMBL4824866)
IC50
<1.000000±n/a nM
Citation
 Deddouche-Grass, SAndouche, CBärenz, FHalter, CHohwald, ALebrun, LMembré, NMorales, RMuzet, NPoirot, MReynaud, MRoujean, VWeber, FZimmermann, AHeng, RBasse, N Discovery and Optimization of a Series of Benzofuran Selective ERAP1 Inhibitors: Biochemical and  ACS Med Chem Lett 12:1137-1142 (2021)  
Target
Name:
Aminopeptidase N
Synonyms:
AMPN_HUMAN APN Aminopeptidase CD_antigen=CD13 Myeloid plasma membrane glycoprotein CD13 gp150 | hAPN
Type:
PROTEIN
Mol. Mass.:
109522.63
Organism:
Homo sapiens (Human)
Description:
ChEMBL_1507526
Residue:
967
  
Inhibitor
Name:
BDBM50076744
Synonyms:
CHEMBL3416733
Type:
Small organic molecule
Emp. Form.:
C27H37N4O4P
Mol. Mass.:
512.5808
SMILES:
CC(C)C[C@H](CP(O)(=O)[C@@H](N)CCc1ccccc1)C(=O)N[C@@H](Cc1c[nH]c2ccccc12)C(N)=O
: