Target
Tyrosine-protein kinase receptor UFO
Ligand
BDBM50571928
Substrate
Meas. Tech.
ChEMBL_2116013 (CHEMBL4824954)
IC50
150±n/a nM
Citation
 Inoue, SYamane, YTsukamoto, SMurai, NAzuma, HNagao, SNishibata, KFukushima, SIchikawa, KNakagawa, THata Sugi, NIto, DKato, YGoto, AKakiuchi, DUeno, TMatsui, JMatsushima, T Discovery of 5,6,7,8-tetrahydropyrido[3,4-d]pyrimidine derivatives as novel selective Axl inhibitors. Bioorg Med Chem Lett 48:0 (2021)  
Target
Name:
Tyrosine-protein kinase receptor UFO
Synonyms:
2.7.10.1 Ark Tyrosine-protein kinase receptor UFO Ufo
Type:
PROTEIN
Mol. Mass.:
98177.22
Organism:
Mus musculus
Description:
ChEMBL_120415
Residue:
888
  
Inhibitor
Name:
BDBM50571928
Synonyms:
CHEMBL4869791
Type:
Small organic molecule
Emp. Form.:
C28H26F2N6O4
Mol. Mass.:
548.5406
SMILES:
CC(C)n1cc(C(=O)Nc2ccc(Oc3ncnc4CCN(C)Cc34)c(F)c2)c(=O)n(-c2ccc(F)cc2)c1=O
: