Target
Phosphatidylinositol 4,5-bisphosphate 3-kinase catalytic subunit delta isoform
Ligand
BDBM50571983
Substrate
Meas. Tech.
ChEMBL_2116056 (CHEMBL4824997)
IC50
5.5±n/a nM
Citation
 Tian, CYang, CWu, TLu, MChen, YYang, YLiu, XLing, YDeng, MJia, YZhou, Y Discovery of cinnoline derivatives as potent PI3K inhibitors with antiproliferative activity. Bioorg Med Chem Lett 48:0 (2021)  
Target
Name:
Phosphatidylinositol 4,5-bisphosphate 3-kinase catalytic subunit delta isoform
Synonyms:
PI3-kinase p110 subunit delta PI3-kinase subunit p110-delta PIK3CD Phosphatidylinositol 4,5-biphosphate 3-kinase catalytic subunit delta (PIK3CD) Phosphatidylinositol 4,5-bisphosphate 3-kinase 110 kDa catalytic subunit delta (PI3K delta) Phosphatidylinositol 4,5-bisphosphate 3-kinase catalytic subunit delta (PI3Kdelta) Phosphatidylinositol 4,5-bisphosphate 3-kinase catalytic subunit delta isoform (PI3K delta) Phosphatidylinositol 4,5-bisphosphate 3-kinase catalytic subunit delta isoform (PI3K-delta) Phosphatidylinositol 4,5-bisphosphate 3-kinase catalytic subunit delta isoform (PI3Kdelta)
Type:
Enzyme Subunit
Mol. Mass.:
119489.41
Organism:
Homo sapiens (Human)
Description:
O00329
Residue:
1044
  
Inhibitor
Name:
BDBM50571983
Synonyms:
CHEMBL4851945
Type:
Small organic molecule
Emp. Form.:
C27H22ClN5O2S
Mol. Mass.:
516.014
SMILES:
C[C@@H](Nc1cnnc2ccc(cc12)-c1cnc(Cl)c(NS(=O)(=O)c2ccccc2)c1)c1ccccc1
: