Target
Phosphatidylinositol 4,5-bisphosphate 3-kinase catalytic subunit delta isoform
Ligand
BDBM50571993
Substrate
Meas. Tech.
ChEMBL_2116056 (CHEMBL4824997)
IC50
0.210000±n/a nM
Citation
 Tian, CYang, CWu, TLu, MChen, YYang, YLiu, XLing, YDeng, MJia, YZhou, Y Discovery of cinnoline derivatives as potent PI3K inhibitors with antiproliferative activity. Bioorg Med Chem Lett 48:0 (2021)  
Target
Name:
Phosphatidylinositol 4,5-bisphosphate 3-kinase catalytic subunit delta isoform
Synonyms:
PI3-kinase p110 subunit delta PI3-kinase subunit p110-delta PIK3CD Phosphatidylinositol 4,5-biphosphate 3-kinase catalytic subunit delta (PIK3CD) Phosphatidylinositol 4,5-bisphosphate 3-kinase 110 kDa catalytic subunit delta (PI3K delta) Phosphatidylinositol 4,5-bisphosphate 3-kinase catalytic subunit delta (PI3Kdelta) Phosphatidylinositol 4,5-bisphosphate 3-kinase catalytic subunit delta isoform (PI3K delta) Phosphatidylinositol 4,5-bisphosphate 3-kinase catalytic subunit delta isoform (PI3K-delta) Phosphatidylinositol 4,5-bisphosphate 3-kinase catalytic subunit delta isoform (PI3Kdelta)
Type:
Enzyme Subunit
Mol. Mass.:
119489.41
Organism:
Homo sapiens (Human)
Description:
O00329
Residue:
1044
  
Inhibitor
Name:
BDBM50571993
Synonyms:
CHEMBL4871213
Type:
Small organic molecule
Emp. Form.:
C22H15ClN6O2S
Mol. Mass.:
462.912
SMILES:
Clc1ncc(cc1NS(=O)(=O)c1ccccc1)-c1ccc2nncc(-n3ccnc3)c2c1
: