Target
Ephrin type-A receptor 4
Ligand
BDBM50572053
Substrate
Meas. Tech.
ChEMBL_2116084 (CHEMBL4825025)
Kd
437±n/a nM
Citation
 Baggio, CKulinich, ADennys, CNRodrigo, RMeyer, KEthell, IPellecchia, M NMR-Guided Design of Potent and Selective EphA4 Agonistic Ligands. J Med Chem 64:11229-11246 (2021)  
Target
Name:
Ephrin type-A receptor 4
Synonyms:
EPHA4 Ephrin receptor HEK8 TYRO1
Type:
PROTEIN
Mol. Mass.:
109859.29
Organism:
Homo sapiens (Human)
Description:
ChEMBL_586961
Residue:
986
  
Inhibitor
Name:
BDBM50572053
Synonyms:
CHEMBL4874658
Type:
Small organic molecule
Emp. Form.:
C36H45N7O5
Mol. Mass.:
655.7864
SMILES:
NCCCC[C@H](NC(=O)[C@H](Cc1ccc(cc1)-c1ccccc1)NC(=O)[C@H](Cc1c[nH]c2ccc(O)cc12)NC(=O)CCCN)C(N)=O
: