Target
Ephrin type-A receptor 4
Ligand
BDBM50572056
Substrate
Meas. Tech.
ChEMBL_2116084 (CHEMBL4825025)
Kd
307±n/a nM
Citation
 Baggio, CKulinich, ADennys, CNRodrigo, RMeyer, KEthell, IPellecchia, M NMR-Guided Design of Potent and Selective EphA4 Agonistic Ligands. J Med Chem 64:11229-11246 (2021)  
Target
Name:
Ephrin type-A receptor 4
Synonyms:
EPHA4 Ephrin receptor HEK8 TYRO1
Type:
PROTEIN
Mol. Mass.:
109859.29
Organism:
Homo sapiens (Human)
Description:
ChEMBL_586961
Residue:
986
  
Inhibitor
Name:
BDBM50572056
Synonyms:
CHEMBL4857984
Type:
Small organic molecule
Emp. Form.:
C48H60N10O8
Mol. Mass.:
905.0522
SMILES:
COc1cc(CNC(=O)CNC(=O)[C@H](CCCCNC(N)=N)NC(=O)[C@H](Cc2ccc(cc2)-c2ccccc2)NC(=O)[C@H](Cc2c[nH]c3ccc(O)cc23)NC(=O)CCCN)cc(OC)c1
: