Target
5-hydroxytryptamine receptor 1F
Ligand
BDBM50137539
Substrate
Meas. Tech.
ChEBML_2086
Ki
2.3±n/a nM
Citation
 Mathes, BMHudziak, KJSchaus, JMXu, YCNelson, DLWainscott, DBNutter, SEGough, WHBranchek, TAZgombick, JMFilla, SA Substituted furo[3,2-b]pyridines: novel bioisosteres of 5-HT 1F receptor agonists. Bioorg Med Chem Lett 14:167-70 (2003)  
Target
Name:
5-hydroxytryptamine receptor 1F
Synonyms:
5-HT-1F 5-hydroxytryptamine receptor 1F HTR1EL Serotonin (5-HT) receptor Serotonin receptor 1F
Type:
Enzyme Catalytic Domain
Mol. Mass.:
41724.68
Organism:
Homo sapiens (Human)
Description:
5-HT1F HTR1F HUMAN::P30939
Residue:
366
  
Inhibitor
Name:
BDBM50137539
Synonyms:
2,4,6-Trifluoro-N-[3-(1-methyl-piperidin-4-yl)-furo[3,2-b]pyridin-5-yl]-benzamide | CHEMBL173949
Type:
Small organic molecule
Emp. Form.:
C20H18F3N3O2
Mol. Mass.:
389.371
SMILES:
CN1CCC(CC1)c1coc2ccc(NC(=O)c3c(F)cc(F)cc3F)nc12
: