Target
Calcium and integrin-binding protein 1
Ligand
BDBM50572356
Substrate
Meas. Tech.
ChEMBL_2116701 (CHEMBL4825642)
IC50
46000±n/a nM
Citation
 Haberman, VAFleming, SRLeisner, TMPuhl, ACFeng, EXie, LChen, XGoto, YSuga, HParise, LVKireev, DPearce, KHBowers, AA Discovery and Development of Cyclic Peptide Inhibitors of CIB1. ACS Med Chem Lett 12:1832-1839 (2021)  
Target
Name:
Calcium and integrin-binding protein 1
Synonyms:
CIB CIB1_HUMAN Calcium- and integrin-binding protein KIP | PRKDCIP
Type:
PROTEIN
Mol. Mass.:
21691.54
Organism:
Homo sapiens
Description:
ChEMBL_120467
Residue:
191
  
Inhibitor
Name:
BDBM50572356
Synonyms:
CHEMBL4872329
Type:
Small organic molecule
Emp. Form.:
C95H135ClN20O27S
Mol. Mass.:
2056.724
SMILES:
CSCC[C@H](NC(=O)[C@H](C)NC(=O)CNC(=O)[C@H](Cc1ccc(O)cc1)NC(=O)[C@H](Cc1c[nH]c2ccccc12)NC(=O)[C@H](Cc1ccccc1)NC(=O)[C@H](CO)NC(=O)CNC(=O)CNC(=O)[C@H](CC(O)=O)NC(=O)[C@H](CCC(O)=O)NC(=O)CCC(=O)NCCOCCOCCCCCCCl)C(=O)N[C@@H](CCCCN)C(=O)N[C@@H](C)C(=O)N[C@@H](CC(C)C)C(=O)N[C@@H](Cc1ccc(O)cc1)C(=O)NCC(N)=O
: