Target
Calcium and integrin-binding protein 1
Ligand
BDBM50572358
Substrate
Meas. Tech.
ChEMBL_2116701 (CHEMBL4825642)
IC50
>10000000±n/a nM
Citation
 Haberman, VAFleming, SRLeisner, TMPuhl, ACFeng, EXie, LChen, XGoto, YSuga, HParise, LVKireev, DPearce, KHBowers, AA Discovery and Development of Cyclic Peptide Inhibitors of CIB1. ACS Med Chem Lett 12:1832-1839 (2021)  
Target
Name:
Calcium and integrin-binding protein 1
Synonyms:
CIB CIB1_HUMAN Calcium- and integrin-binding protein KIP | PRKDCIP
Type:
PROTEIN
Mol. Mass.:
21691.54
Organism:
Homo sapiens
Description:
ChEMBL_120467
Residue:
191
  
Inhibitor
Name:
BDBM50572358
Synonyms:
CHEMBL4848001
Type:
Small organic molecule
Emp. Form.:
C146H248ClN53O40S
Mol. Mass.:
3453.38
SMILES:
CSCC[C@H](NC(=O)[C@H](C)NC(=O)CNC(=O)[C@H](Cc1ccc(O)cc1)NC(=O)[C@H](C)NC(=O)[C@H](Cc1ccccc1)NC(=O)[C@H](CO)NC(=O)CNC(=O)CNC(=O)[C@H](CC(O)=O)NC(=O)[C@H](CCC(O)=O)NC(=O)[C@H](CCC(N)=O)NC(=O)[C@@H]1CCCN1C(=O)[C@H](CCCNC(N)=N)NC(=O)[C@H](CCCNC(N)=N)NC(=O)[C@H](CCCNC(N)=N)NC(=O)[C@H](CCC(N)=O)NC(=O)[C@H](CCCNC(N)=N)NC(=O)[C@H](CCCNC(N)=N)NC(=O)[C@H](CCCCN)NC(=O)[C@H](CCCCN)NC(=O)[C@H](CCCNC(N)=N)NC(=O)CNC(=O)CCC(=O)NCCOCCOCCCCCCCl)C(=O)N[C@@H](CCCCN)C(=O)N[C@@H](C)C(=O)N[C@@H](CC(C)C)C(=O)N[C@@H](C)C(=O)NCC(N)=O
: