Target
Neuronal acetylcholine receptor subunit alpha-7
Ligand
BDBM50572644
Substrate
Meas. Tech.
ChEMBL_2117619 (CHEMBL4826685)
EC50
920±n/a nM
Citation
 Ledneczki, IHorváth, ATapolcsányi, PÉles, JMolnár, KDVágó, IVisegrády, AKiss, LSzigetvári, ÁKóti, JKrámos, BMahó, SHolm, PKolok, SFodor, LThán, MKostyalik, DBalázs, OVastag, MGreiner, ILévay, GLendvai, BNémethy, Z HTS-based discovery and optimization of novel positive allosteric modulators of the ?7 nicotinic acetylcholine receptor. Eur J Med Chem 222:0 (2021)  
Target
Name:
Neuronal acetylcholine receptor subunit alpha-7
Synonyms:
ACHA7_HUMAN Cholinergic, Nicotinic Alpha7 Neuronal acetylcholine receptor protein alpha-7 subunit Nicotinic acetylcholine receptor alpha-7 (alpha7 nAChR)
Type:
Mol. Mass.:
56448.33
Organism:
Homo sapiens (Human)
Description:
CHRNA7 (NACHRA7)
Residue:
502
  
Inhibitor
Name:
BDBM50572644
Synonyms:
CHEMBL4865579
Type:
Small organic molecule
Emp. Form.:
C24H28N4O2
Mol. Mass.:
404.5047
SMILES:
Cc1cn(C)c2ccc(NC(=O)C(=O)N3CCN(Cc4ccc(C)cc4)CC3)cc12
: