Target
N6-adenosine-methyltransferase catalytic subunit
Ligand
BDBM50572910
Substrate
Meas. Tech.
ChEMBL_2118555 (CHEMBL4827621)
IC50
<10.0±n/a nM
Citation
 Sabnis, RW Novel METTL3 Modulators for Treating Acute Myeloid Leukemia (AML). ACS Med Chem Lett 12:1061-1062 (2021)  
Target
Name:
N6-adenosine-methyltransferase catalytic subunit
Synonyms:
2.1.1.348 MT-A70 MTA70_HUMAN N6-adenosine-methyltransferase 70 kDa subunit hMETTL3
Type:
PROTEIN
Mol. Mass.:
64471.71
Organism:
Homo sapiens
Description:
ChEMBL_120160
Residue:
580
  
Inhibitor
Name:
BDBM50572910
Synonyms:
CHEMBL4861007
Type:
Small organic molecule
Emp. Form.:
C26H25FN8O3
Mol. Mass.:
516.5269
SMILES:
Nc1ncnc2n(cc(-n3cccn3)c12)[C@@H]1O[C@H](COc2ccc3ccc(nc3c2)N2CCC2)[C@@H](O)[C@@H]1F
: