Target
N6-adenosine-methyltransferase catalytic subunit
Ligand
BDBM50572908
Substrate
Meas. Tech.
ChEMBL_2118556 (CHEMBL4827622)
IC50
<1000±n/a nM
Citation
 Sabnis, RW Novel METTL3 Modulators for Treating Acute Myeloid Leukemia (AML). ACS Med Chem Lett 12:1061-1062 (2021)  
Target
Name:
N6-adenosine-methyltransferase catalytic subunit
Synonyms:
2.1.1.348 MT-A70 MTA70_HUMAN N6-adenosine-methyltransferase 70 kDa subunit hMETTL3
Type:
PROTEIN
Mol. Mass.:
64471.71
Organism:
Homo sapiens
Description:
ChEMBL_120160
Residue:
580
  
Inhibitor
Name:
BDBM50572908
Synonyms:
CHEMBL4872977
Type:
Small organic molecule
Emp. Form.:
C26H25FN6O4
Mol. Mass.:
504.5129
SMILES:
CNc1ccc2ccc(OC[C@H]3O[C@H]([C@@H](F)[C@@H]3O)n3cc(-c4ccc(C)o4)c4c(N)ncnc34)cc2n1
: