Target
N6-adenosine-methyltransferase catalytic subunit
Ligand
BDBM50572911
Substrate
Meas. Tech.
ChEMBL_2118556 (CHEMBL4827622)
IC50
<1000±n/a nM
Citation
 Sabnis, RW Novel METTL3 Modulators for Treating Acute Myeloid Leukemia (AML). ACS Med Chem Lett 12:1061-1062 (2021)  
Target
Name:
N6-adenosine-methyltransferase catalytic subunit
Synonyms:
2.1.1.348 MT-A70 MTA70_HUMAN N6-adenosine-methyltransferase 70 kDa subunit hMETTL3
Type:
PROTEIN
Mol. Mass.:
64471.71
Organism:
Homo sapiens
Description:
ChEMBL_120160
Residue:
580
  
Inhibitor
Name:
BDBM50572911
Synonyms:
CHEMBL4852677
Type:
Small organic molecule
Emp. Form.:
C27H29FN6O4
Mol. Mass.:
520.5554
SMILES:
Nc1ncnc2n(cc([C@@H]3CCCO3)c12)[C@@H]1O[C@H](COc2ccc3ccc(nc3c2)N2CCC2)[C@@H](O)[C@@H]1F
: