Target
Tyrosine-protein kinase Mer
Ligand
BDBM50573129
Substrate
Meas. Tech.
ChEMBL_2119091 (CHEMBL4828157)
IC50
16±n/a nM
Target
Name:
Tyrosine-protein kinase Mer
Synonyms:
MER MERTK Proto-oncogene c-Mer Receptor tyrosine kinase MerTK | Tyrosine-protein kinase Mer
Type:
PROTEIN
Mol. Mass.:
110234.77
Organism:
Homo sapiens (Human)
Description:
ChEMBL_1498723
Residue:
999
  
Inhibitor
Name:
BDBM50573129
Synonyms:
CHEMBL4872116
Type:
Small organic molecule
Emp. Form.:
C24H25N7O2
Mol. Mass.:
443.501
SMILES:
COc1cc(ccc1-c1nnc(o1)N(C)Cc1ccc2nccn2c1)-c1c(C)nn(C)c1C
: