Target
Tyrosine-protein kinase Mer
Ligand
BDBM50573133
Substrate
Meas. Tech.
ChEMBL_2119091 (CHEMBL4828157)
IC50
63±n/a nM
Target
Name:
Tyrosine-protein kinase Mer
Synonyms:
MER MERTK Proto-oncogene c-Mer Receptor tyrosine kinase MerTK | Tyrosine-protein kinase Mer
Type:
PROTEIN
Mol. Mass.:
110234.77
Organism:
Homo sapiens (Human)
Description:
ChEMBL_1498723
Residue:
999
  
Inhibitor
Name:
BDBM50573133
Synonyms:
CHEMBL4865034
Type:
Small organic molecule
Emp. Form.:
C23H24N8O
Mol. Mass.:
428.4897
SMILES:
CN(Cc1ccc2nccn2c1)c1nnc(o1)-c1ccc(nc1C)-c1c(C)nn(C)c1C
: