Target
Tyrosine-protein kinase receptor UFO
Ligand
BDBM50573135
Substrate
Meas. Tech.
ChEMBL_2119092 (CHEMBL4828158)
IC50
100±n/a nM
Target
Name:
Tyrosine-protein kinase receptor UFO
Synonyms:
AXL TEL/AXL UFO | UFO_HUMAN
Type:
Enzyme
Mol. Mass.:
98316.97
Organism:
Homo sapiens (Human)
Description:
P30530
Residue:
894
  
Inhibitor
Name:
BDBM50573135
Synonyms:
CHEMBL4873217
Type:
Small organic molecule
Emp. Form.:
C23H23N7O
Mol. Mass.:
413.475
SMILES:
CN(Cc1ccc2nccn2c1)c1nnc(o1)-c1ccc(cc1C)-c1cnn(C)c1C
: