Target
Tyrosine-protein kinase receptor UFO
Ligand
BDBM50573136
Substrate
Meas. Tech.
ChEMBL_2119092 (CHEMBL4828158)
IC50
40±n/a nM
Target
Name:
Tyrosine-protein kinase receptor UFO
Synonyms:
AXL TEL/AXL UFO | UFO_HUMAN
Type:
Enzyme
Mol. Mass.:
98316.97
Organism:
Homo sapiens (Human)
Description:
P30530
Residue:
894
  
Inhibitor
Name:
BDBM50573136
Synonyms:
CHEMBL4875486
Type:
Small organic molecule
Emp. Form.:
C24H22N8O
Mol. Mass.:
438.4845
SMILES:
CN(Cc1ccc2nccn2c1)c1nnc(o1)-c1ccc(cc1C)-c1c(C)nn(C)c1C#N
: