Target
Receptor-type tyrosine-protein kinase FLT3
Ligand
BDBM50573135
Substrate
Meas. Tech.
ChEMBL_2119094 (CHEMBL4828160)
IC50
79±n/a nM
Target
Name:
Receptor-type tyrosine-protein kinase FLT3
Synonyms:
CD135 FL cytokine receptor FLK2 FLT3 Fetal liver kinase-2 Fms-like tyrosine kinase 3 (Flt-3) STK-1 Stem cell tyrosine kinase 1
Type:
Enzyme
Mol. Mass.:
112888.62
Organism:
Homo sapiens (Human)
Description:
P36888
Residue:
993
  
Inhibitor
Name:
BDBM50573135
Synonyms:
CHEMBL4873217
Type:
Small organic molecule
Emp. Form.:
C23H23N7O
Mol. Mass.:
413.475
SMILES:
CN(Cc1ccc2nccn2c1)c1nnc(o1)-c1ccc(cc1C)-c1cnn(C)c1C
: