Target
Histone acetyltransferase KAT2B
Ligand
BDBM50573203
Substrate
Meas. Tech.
ChEMBL_2119172 (CHEMBL4828238)
Kd
300±n/a nM
Citation
 Zahid, HBuchholz, CRSingh, MCiccone, MFChan, ANithianantham, SShi, KAihara, HFischer, MSchönbrunn, EDos Santos, COLandry, JWPomerantz, WCK New Design Rules for Developing Potent Cell-Active Inhibitors of the Nucleosome Remodeling Factor (NURF) via BPTF Bromodomain Inhibition. J Med Chem 64:13902-13917 (2021)  
Target
Name:
Histone acetyltransferase KAT2B
Synonyms:
Histone acetyltransferase KAT2A/KAT2B KAT2B PCAF
Type:
PROTEIN
Mol. Mass.:
93045.76
Organism:
Homo sapiens (Human)
Description:
ChEMBL_1502838
Residue:
832
  
Inhibitor
Name:
BDBM50573203
Synonyms:
CHEMBL4863631
Type:
Small organic molecule
Emp. Form.:
C13H12ClN5O
Mol. Mass.:
289.72
SMILES:
NCc1ccc(Nc2cnn(CC#N)c(=O)c2Cl)cc1
: