Target
5-hydroxytryptamine receptor 1A
Ligand
BDBM50573249
Substrate
Meas. Tech.
ChEMBL_2119288 (CHEMBL4828354)
Ki
121±n/a nM
Citation
 Kwag, RLee, JKim, DLee, HYeom, MWoo, JCho, YKim, HJKim, JKeum, GJeon, BChoo, H Discovery of G Protein-Biased Antagonists against 5-HT J Med Chem 64:13766-13779 (2021)  
Target
Name:
5-hydroxytryptamine receptor 1A
Synonyms:
5-HT-1A 5-hydroxytryptamine receptor 1A (5-HT-1A) ADRB2RL1 Dopamine D2 receptor and serotonin 1a receptor HTR1A | Serotonin receptor 1A
Type:
Mol. Mass.:
46122.49
Organism:
Homo sapiens (Human)
Description:
Residue:
422
  
Inhibitor
Name:
BDBM50573249
Synonyms:
CHEMBL4858338
Type:
Small organic molecule
Emp. Form.:
C13H15ClN4
Mol. Mass.:
262.738
SMILES:
Clc1ccc(cc1)-c1n[nH]cc1N1CCNCC1
: