Target
Interleukin-17A
Ligand
BDBM50573256
Substrate
Meas. Tech.
ChEMBL_2119335 (CHEMBL4828401)
Kd
89±n/a nM
Citation
 Anzai, HTerai, TWakabayashi-Nakao, KNoguchi, TKumachi, STsuchiya, MNemoto, N Interleukin-17A Peptide Aptamers with an Unexpected Binding Moiety Selected by cDNA Display under Heterogenous Conditions. ACS Med Chem Lett 12:1427-1434 (2021)  
Target
Name:
Interleukin-17A
Synonyms:
CTLA8 IL-17 IL17A il-17a
Type:
Enzyme Catalytic Domain
Mol. Mass.:
17511.44
Organism:
Homo sapiens (Human)
Description:
Q16552
Residue:
155
  
Inhibitor
Name:
BDBM50573256
Synonyms:
CHEMBL4854787
Type:
Small organic molecule
Emp. Form.:
C70H103N13O17S2
Mol. Mass.:
1462.774
SMILES:
CC(C)C[C@H](NC(=O)[C@H](Cc1ccccc1)NC(=O)[C@@H](NC(=O)[C@H](CC(C)C)NC(=O)[C@H](CC(C)C)NC(=O)[C@H](C)NC(=O)[C@@H](N)CS)[C@@H](C)O)C(=O)NCC(=O)N[C@@H](Cc1ccc(O)cc1)C(=O)N1CCC[C@H]1C(=O)N[C@@H](C(C)C)C(=O)N[C@@H](Cc1ccc(O)cc1)C(=O)N[C@@H](CS)C(O)=O
: