Target
Prostaglandin G/H synthase 1
Ligand
BDBM50074922
Substrate
Meas. Tech.
ChEMBL_159410 (CHEMBL764146)
IC50
12±n/a nM
Citation
 Gupta, KKaub, CJCarey, KNCasillas, EGSelinsky, BSLoll, PJ Manipulation of kinetic profiles in 2-aryl propionic acid cyclooxygenase inhibitors. Bioorg Med Chem Lett 14:667-71 (2004)  
Target
Name:
Prostaglandin G/H synthase 1
Synonyms:
COX1 Cyclooxygenase-1 (COX-1) PTGS1 | Prostaglandin G/H synthase (cyclooxygenase)
Type:
Protein
Mol. Mass.:
68868.60
Organism:
Ovis aries (Sheep)
Description:
Residue:
600
  
Inhibitor
Name:
BDBM50074922
Synonyms:
(+-)-2-fluoro-alpha-methyl-4-biphenylacetic acid 2-(2-fluorobiphenyl-4-yl)propanoic acid 3-fluoro-4-phenylhydratropic acid CHEMBL563 US9630914, Compound A
Type:
Small organic molecule
Emp. Form.:
C15H13FO2
Mol. Mass.:
244.2609
SMILES:
CC(C(O)=O)c1ccc(c(F)c1)-c1ccccc1
: