Target
Probable G-protein coupled receptor 27
Ligand
BDBM50574002
Substrate
Meas. Tech.
ChEMBL_2121597 (CHEMBL4830744)
EC50
<100000±n/a nM
Citation
 Pillaiyar, TRosato, FWozniak, MBlavier, JCharles, MLaschet, CKronenberger, TMüller, CEHanson, J Structure-activity relationships of agonists for the orphan G protein-coupled receptor GPR27. Eur J Med Chem 225:0 (2021)  
Target
Name:
Probable G-protein coupled receptor 27
Synonyms:
GPR27 Probable G-protein coupled receptor 27 Super conserved receptor expressed in brain 1
Type:
PROTEIN
Mol. Mass.:
39835.29
Organism:
Homo sapiens
Description:
ChEMBL_119640
Residue:
375
  
Inhibitor
Name:
BDBM50574002
Synonyms:
CHEMBL4872873
Type:
Small organic molecule
Emp. Form.:
C19H14Cl2N2O3S
Mol. Mass.:
421.297
SMILES:
Clc1ccc(C(=O)Nc2cccc(c2)S(=O)(=O)Nc2ccccc2)c(Cl)c1
: