Target
Probable G-protein coupled receptor 27
Ligand
BDBM50574020
Substrate
Meas. Tech.
ChEMBL_2121597 (CHEMBL4830744)
EC50
<10000±n/a nM
Citation
 Pillaiyar, TRosato, FWozniak, MBlavier, JCharles, MLaschet, CKronenberger, TMüller, CEHanson, J Structure-activity relationships of agonists for the orphan G protein-coupled receptor GPR27. Eur J Med Chem 225:0 (2021)  
Target
Name:
Probable G-protein coupled receptor 27
Synonyms:
GPR27 Probable G-protein coupled receptor 27 Super conserved receptor expressed in brain 1
Type:
PROTEIN
Mol. Mass.:
39835.29
Organism:
Homo sapiens
Description:
ChEMBL_119640
Residue:
375
  
Inhibitor
Name:
BDBM50574020
Synonyms:
CHEMBL4856118
Type:
Small organic molecule
Emp. Form.:
C20H14Cl2N2O2
Mol. Mass.:
385.243
SMILES:
Clc1ccc(C(=O)Nc2ccc(cc2)C(=O)Nc2ccccc2)c(Cl)c1
: