Target
Melanocortin receptor 3
Ligand
BDBM50574236
Substrate
Meas. Tech.
ChEMBL_2122100 (CHEMBL4831247)
Ki
32±n/a nM
Citation
 Ericson, MDDoering, SRLarson, CMFreeman, KTLaVoi, TMDonow, HMSantos, RGCho, RHKoerperich, ZMGiulianotti, MAPinilla, CHoughten, RAHaskell-Luevano, C Functional Mixture-Based Positional Scan Identifies a Library of Antagonist Tetrapeptide Sequences (LAtTeS) with Nanomolar Potency for the Melanocortin-4 Receptor and Equipotent with the Endogenous AGRP(86-132) Antagonist. J Med Chem 64:14860-14875 (2021)  
Target
Name:
Melanocortin receptor 3
Synonyms:
MC3-R Mc3r
Type:
PROTEIN
Mol. Mass.:
35808.24
Organism:
Mus musculus
Description:
ChEMBL_1498848
Residue:
323
  
Inhibitor
Name:
BDBM50574236
Synonyms:
CHEMBL4848948
Type:
Small organic molecule
Emp. Form.:
C32H45I2N9O5
Mol. Mass.:
889.5659
SMILES:
CC(=O)N[C@H](Cc1ccc(I)cc1)C(=O)N[C@@H](CCCNC(N)=N)C(=O)N[C@H](Cc1ccc(I)cc1)C(=O)N[C@H](CCCCN)C(N)=O
: