Target
Interleukin-17A
Ligand
BDBM50574354
Substrate
Meas. Tech.
ChEMBL_2122293 (CHEMBL4831440)
IC50
10±n/a nM
Citation
 Sabnis, RW Imidazo[1,2- ACS Med Chem Lett 12:1526-1527 (2021)  
Target
Name:
Interleukin-17A
Synonyms:
CTLA8 IL-17 IL17A il-17a
Type:
Enzyme Catalytic Domain
Mol. Mass.:
17511.44
Organism:
Homo sapiens (Human)
Description:
Q16552
Residue:
155
  
Inhibitor
Name:
BDBM50574354
Synonyms:
CHEMBL4866932
Type:
Small organic molecule
Emp. Form.:
C22H20F8N8O3
Mol. Mass.:
596.4332
SMILES:
FC(F)(F)[C@@H]1CN(Cc2cnn3cc(nc3c2)[C@@H](NC(=O)c2nonc2C(F)(F)F)C2CCC(F)(F)CC2)C(=O)N1
: