Target
Interleukin-17A
Ligand
BDBM50574357
Substrate
Meas. Tech.
ChEMBL_2122293 (CHEMBL4831440)
IC50
4.6±n/a nM
Citation
 Sabnis, RW Imidazo[1,2- ACS Med Chem Lett 12:1526-1527 (2021)  
Target
Name:
Interleukin-17A
Synonyms:
CTLA8 IL-17 IL17A il-17a
Type:
Enzyme Catalytic Domain
Mol. Mass.:
17511.44
Organism:
Homo sapiens (Human)
Description:
Q16552
Residue:
155
  
Inhibitor
Name:
BDBM50574357
Synonyms:
CHEMBL4855085
Type:
Small organic molecule
Emp. Form.:
C24H24F8N8O4
Mol. Mass.:
640.4858
SMILES:
COC[C@@H](N1C[C@H](NC1=O)C(F)(F)F)c1cnn2cc(nc2c1)[C@@H](NC(=O)c1nonc1C(F)(F)F)C1CCC(F)(F)CC1
: