Target
Pannexin-1
Ligand
BDBM50574565
Substrate
Meas. Tech.
ChEMBL_2122674 (CHEMBL4831907)
IC50
4900±n/a nM
Citation
 Crocetti, LGuerrini, GPuglioli, SGiovannoni, MPDi Cesare Mannelli, LLucarini, EGhelardini, CWang, JDahl, G Design and synthesis of the first indole-based blockers of Panx-1 channel. Eur J Med Chem 223:0 (2021)  
Target
Name:
Pannexin-1
Synonyms:
PANX1_MOUSE Panx1
Type:
PROTEIN
Mol. Mass.:
48168.73
Organism:
Mus musculus
Description:
ChEMBL_120484
Residue:
426
  
Inhibitor
Name:
BDBM50574565
Synonyms:
CHEMBL4858078
Type:
Small organic molecule
Emp. Form.:
C17H12N2O6
Mol. Mass.:
340.287
SMILES:
OC(=O)c1cc2cc(ccc2n1Cc1ccc(cc1)C(O)=O)[N+]([O-])=O
: