Target
Pannexin-1
Ligand
BDBM50206509
Substrate
Meas. Tech.
ChEMBL_2122674 (CHEMBL4831907)
IC50
150000±n/a nM
Citation
 Crocetti, LGuerrini, GPuglioli, SGiovannoni, MPDi Cesare Mannelli, LLucarini, EGhelardini, CWang, JDahl, G Design and synthesis of the first indole-based blockers of Panx-1 channel. Eur J Med Chem 223:0 (2021)  
Target
Name:
Pannexin-1
Synonyms:
PANX1_MOUSE Panx1
Type:
PROTEIN
Mol. Mass.:
48168.73
Organism:
Mus musculus
Description:
ChEMBL_120484
Residue:
426
  
Inhibitor
Name:
BDBM50206509
Synonyms:
4-Dipropylsulfamoyl-benzoic acid 4-Dipropylsulfamoyl-benzoic acid(probenecid) CHEMBL897 Probalan
Type:
Small organic molecule
Emp. Form.:
C13H19NO4S
Mol. Mass.:
285.359
SMILES:
CCCN(CCC)S(=O)(=O)c1ccc(cc1)C(O)=O
: