Target
Transthyretin
Ligand
BDBM50197883
Substrate
Meas. Tech.
ChEMBL_2124234 (CHEMBL4833467)
Kd
200±n/a nM
Citation
 Yokoyama, TKashihara, MMizuguchi, M Repositioning of the Anthelmintic Drugs Bithionol and Triclabendazole as Transthyretin Amyloidogenesis Inhibitors. J Med Chem 64:14344-14357 (2021)  
Target
Name:
Transthyretin
Synonyms:
ATTR Prealbumin TTHY_HUMAN Transthyretin (TTR)
Type:
Enzyme
Mol. Mass.:
15884.31
Organism:
Homo sapiens (Human)
Description:
P02766
Residue:
147
  
Inhibitor
Name:
BDBM50197883
Synonyms:
CHEBI:78538 Tafamidis Vyndaqel
Type:
Small organic molecule
Emp. Form.:
C14H7Cl2NO3
Mol. Mass.:
308.116
SMILES:
OC(=O)c1ccc2nc(oc2c1)-c1cc(Cl)cc(Cl)c1
: