Target
Protein orai-2/Stromal interaction molecule 1
Ligand
BDBM50575336
Substrate
Meas. Tech.
ChEMBL_2124969 (CHEMBL4834202)
IC50
895±n/a nM
Citation
 Khedkar, NRIrlapatti, NRDadke, DKanoje, VShaikh, ZKarche, VShinde, VDeshmukh, GPatil, AJachak, SPhukan, SKizhakinagath, PAGholve, MBhankhede, TDaler, JNemade, HNBudhe, SPareek, HYeshodharan, RGupta, RKalia, APandey, DWagh, AKumar, SPatil, VModi, DSharma, NAhirrao, PMehta, MKumar, HNigade, PTamane, KMallurwar, SKuldharan, SPawar, SVishwase, GBokan, SSingh, MNaik, KIngawale, SShankar, RKamalakannan, PVenugopal, SGeorge, SKPadiya, KJNemmani, KVSGundu, JBhonde, MNarasimham, LSindkhedkar, MShah, CSinha, NSharma, SBakhle, DKamboj, RKPalle, VP Discovery of a Novel Potent and Selective Calcium Release-Activated Calcium Channel Inhibitor: 2,6-Difluoro- J Med Chem 64:17004-17030 (2021)  
Target
Name:
Protein orai-2/Stromal interaction molecule 1
Synonyms:
Type:
Mol. Mass.:
Description:
ASSAY_ID of ChEMBL is 2124969
Components:
This complex has 2 components.
Component 1
Name:
Protein orai-2
Synonyms:
C7orf19 CBCIP2 ORAI2_HUMAN TMEM142B Transmembrane protein 142B
Type:
PROTEIN
Mol. Mass.:
28579.60
Organism:
Homo sapiens
Description:
ChEMBL_120520
Residue:
254
  
Component 2
Name:
Stromal interaction molecule 1
Synonyms:
GOK STIM1_HUMAN | Stromal interaction molecule 1
Type:
PROTEIN
Mol. Mass.:
77425.50
Organism:
Homo sapiens
Description:
ChEMBL_118315
Residue:
685
  
Inhibitor
Name:
BDBM50575336
Synonyms:
CHEMBL4753998
Type:
Small organic molecule
Emp. Form.:
C19H11ClF3N3O3
Mol. Mass.:
421.757
SMILES:
Cc1cccc(F)c1C(=O)Nc1cnc(cn1)-c1cc2OC(F)(F)Oc2cc1Cl
: