Target
Islet amyloid polypeptide
Ligand
BDBM50575494
Substrate
Meas. Tech.
ChEMBL_2125418 (CHEMBL4834763)
IC50
4400±n/a nM
Citation
 Hsu, JYRao Sathyan, AHsu, KCChen, LCYen, CCTseng, HJWu, KCLiu, HKHuang, WJ Synthesis of Yakuchinone B-Inspired Inhibitors against Islet Amyloid Polypeptide Aggregation. J Nat Prod 84:1096-1103 (2021)  
Target
Name:
Islet amyloid polypeptide
Synonyms:
Amylin Diabetes-associated peptide IAPP_HUMAN Islet amyloid polypeptide
Type:
PROTEIN
Mol. Mass.:
9813.88
Organism:
Homo sapiens
Description:
ChEMBL_104362
Residue:
89
  
Inhibitor
Name:
BDBM50575494
Synonyms:
CHEMBL4877898
Type:
Small organic molecule
Emp. Form.:
C11H12O3
Mol. Mass.:
192.2112
SMILES:
CCC(=O)\C=C\c1ccc(O)c(O)c1
: