Target
Islet amyloid polypeptide
Ligand
BDBM50575502
Substrate
Meas. Tech.
ChEMBL_2125418 (CHEMBL4834763)
IC50
9500±n/a nM
Citation
 Hsu, JYRao Sathyan, AHsu, KCChen, LCYen, CCTseng, HJWu, KCLiu, HKHuang, WJ Synthesis of Yakuchinone B-Inspired Inhibitors against Islet Amyloid Polypeptide Aggregation. J Nat Prod 84:1096-1103 (2021)  
Target
Name:
Islet amyloid polypeptide
Synonyms:
Amylin Diabetes-associated peptide IAPP_HUMAN Islet amyloid polypeptide
Type:
PROTEIN
Mol. Mass.:
9813.88
Organism:
Homo sapiens
Description:
ChEMBL_104362
Residue:
89
  
Inhibitor
Name:
BDBM50575502
Synonyms:
CHEMBL4856745
Type:
Small organic molecule
Emp. Form.:
C11H14O3
Mol. Mass.:
194.2271
SMILES:
CCC(=O)CCc1ccc(O)c(O)c1
: