Target
Alpha-2A adrenergic receptor [16-465]/Alpha-2B adrenergic receptor/Alpha-2C adrenergic receptor
Ligand
BDBM50130262
Substrate
Meas. Tech.
ChEMBL_34219 (CHEMBL648713)
Ki
1600±n/a nM
Citation
 Glennon, RAGrella, BTyacke, RJLau, AWestaway, JHudson, AL Binding of beta-carbolines at imidazoline I2 receptors: a structure-affinity investigation. Bioorg Med Chem Lett 14:999-1002 (2004)  
Target
Name:
Alpha-2A adrenergic receptor [16-465]/Alpha-2B adrenergic receptor/Alpha-2C adrenergic receptor
Synonyms:
Adrenergic receptor alpha-2
Type:
Mol. Mass.:
Description:
ASSAY_ID of ChEMBL is 935397
Components:
This complex has 3 components.
Component 1
Name:
Alpha-2C adrenergic receptor
Synonyms:
ADA2C_RAT Adrenergic receptor alpha adrenergic Alpha2 | adrenergic Alpha2C
Type:
Enzyme Catalytic Domain
Mol. Mass.:
49890.50
Organism:
RAT
Description:
adrenergic Alpha2 0 RAT::P22086
Residue:
458
  
Component 2
Name:
Alpha-2B adrenergic receptor
Synonyms:
ADA2B_RAT Adrenergic receptor alpha Alpha-2B adrenergic receptor Alpha-2B adrenoreceptor | adrenergic Alpha2B
Type:
Enzyme Catalytic Domain
Mol. Mass.:
50379.83
Organism:
NEONATAL RAT
Description:
adrenergic Alpha2B ADRA2B NEONATAL RAT::P19328
Residue:
453
  
Component 3
Name:
Alpha-2A adrenergic receptor [16-465]
Synonyms:
ADA2A_RAT Adrenaline 2 Alpha-2A adrenoceptor Alpha-2AAR Alpha2 Adrenoreceptor adrenergic Alpha2A
Type:
G-protein coupled receptor
Mol. Mass.:
48961.69
Organism:
Rattus norvegicus (rat)
Description:
P22909[16-465]
Residue:
450
  
Inhibitor
Name:
BDBM50130262
Synonyms:
2,3,4,9-Tetrahydro-1H-beta-carboline EN300-119677
Type:
Small organic molecule
Emp. Form.:
C11H12N2
Mol. Mass.:
172.2264
SMILES:
C1Cc2c(CN1)[nH]c1ccccc21
: