Target
Melatonin receptor type 1A
Ligand
BDBM50575683
Substrate
Meas. Tech.
ChEMBL_2125808 (CHEMBL4835153)
Ki
0.027000±n/a nM
Citation
 Hoashi, YTakai, TKosugi, YNakashima, MNakayama, MHirai, KUchikawa, OKoike, T Discovery of a Potent and Orally Bioavailable Melatonin Receptor Agonist. J Med Chem 64:3059-3074 (2021)  
Target
Name:
Melatonin receptor type 1A
Synonyms:
MTNR1A MTR1A_HUMAN Mel1a melatonin receptor Melatonin receptor Melatonin receptor type 1 (MT1) | Melatonin receptor type 1A
Type:
Enzyme
Mol. Mass.:
39392.94
Organism:
Homo sapiens (Human)
Description:
P48039
Residue:
350
  
Inhibitor
Name:
BDBM50575683
Synonyms:
CHEMBL4868554
Type:
Small organic molecule
Emp. Form.:
C16H20N2OS
Mol. Mass.:
288.408
SMILES:
CCC(=O)NCCC1CCc2ccc3nc(C)sc3c12
: